{"text_format":"1","workbook":"xlsx","n_sheets":2,"sheets":["Калькулятор","Данные для расчета"],"not_rendered":{"charts":0,"images":14,"macros":1,"external_links":0,"defined_names":20,"comments":0,"pivot_tables":0},"unopened":[],"bounds":{"document_bytes":16777216,"sheet_cells":100000,"rows_first":2000,"rows_last":500,"rows_between":2000,"halvings":0,"cell_chars":16384,"cell_head_chars":4096},"cells_cut":0,"cells_raw":0,"read":"whole","date_system":"1900"}

{"sheet":"Калькулятор","index":0,"n_rows":114,"n_cols":28,"rows_kept":114,"cut":false,"hidden":false,"merged":[[0,1,0,7],[1,1,1,7],[65,4,65,7],[93,1,95,1],[104,2,104,7],[100,2,100,7],[101,2,101,7],[52,6,52,7],[84,1,85,1],[50,6,50,7],[106,2,106,7],[111,4,111,7],[2,4,2,5],[103,2,103,7],[105,2,105,7],[109,2,109,7],[56,6,56,7],[113,4,113,7],[4,1,4,5],[5,1,5,5],[16,1,16,3],[89,1,91,1],[99,2,99,7],[57,4,57,6],[57,1,59,1],[81,1,82,1],[55,1,55,5],[58,4,58,7],[107,2,107,7],[108,2,108,7],[92,1,92,2],[96,1,96,2],[102,2,102,7]]}
[null,"Расчет платы за технологическое присоединение к электрическим сетям ООО \"ГИП-Электро\""]
[null,"посредством применения стандартизированных тарифных ставок"]
[null,"по договору №"]
[]
[null,"Заявитель: "]
[null,"Объект: жилой дом"]
[null,"Уровень напряжения (0,4/6/10 кВ)",null,null,"0.4","i",null,null,null,null,null,"да",3,0.4,{"$f":"IF(E11<3,2,1)","v":1},1]
[null,"Временная схема электроснабжения (да/нет)",null,null,"нет",null,null,null,null,null,null,"нет",2,6,null,2]
[null,"Объем присоединяемой мощности, кВт",null,null,0,"N",null,null,null,null,null,null,1,10,null,3]
[null,{"$f":"IF(E10<E9,\"Объем максимальной мощности не может быть меньше объема  присоединяемой мощности! Расчет неверен!\",\"Объем максимальной мощности, кВт\")","v":"Объем максимальной мощности, кВт"},null,null,0,"Nmax",null,null,null,null,null,null,null,null,null,4]
[null,"Категория надежности (3/2/1)",null,null,"3"]
[null,"Срок выполнения мероприятий, предусмотренных техническими условиями (1 год и менее / 2 года/ 3 года/ 4 года",null,null,"1"]
[null,"Объем работ, выполняемых Сетевой организацией"]
[null,"Подготовка и выдача ТУ (да/нет)",null,null,"да","С1.1.",null,null,"                                      ",null,709.27,191,53.23,null,null,219.22]
[null,"Проверка выполнения заявителем ТУ (да/нет)",null,null,"да","С1.2.",null,null,null,null,182.07,42.88,13.09,null,null,108.88]
[null,"Участие в осмотре совместно с должностным лицом органа федерального государственного энергетического надзора (да/нет)",null,null,"нет","С1.3.",null,null,null,null,0,29.94,7.39,null,null,0]
[null,"Осуществление действий по фактическому присоединению (да/нет)",null,null,"да","С1.4.",null,null,null,null,313.66000000000003,499.18,436.29,null,null,54.9]
[null,"Выполнение мероприятий сетевой организацией, связанных со строительством \"последней мили\", согласно технических условий",null,null,"Объем строительства, (кВт, км)","Установленная стандартизированная тарифная ставка, руб."]
[null,{"$f":"INDEX(Товары,SMALL(IF((0<Цены),ROW(Цены),\"\"),ROW(Цены)-ROW('Данные для расчета'!I10))-ROW('Данные для расчета'!I10))","v":"Строительство подстанций"},null,null,{"$f":"INDEX(ЦенаВывод,SMALL(IF((0<Цены),ROW(Цены),\"\"),ROW(Цены)-ROW('Данные для расчета'!M10))-ROW('Данные для расчета'!M10))","v":"нет"},{"$f":"INDEX(Тарифы2,SMALL(IF((0<Цены),ROW(Цены),\"\"),ROW(Цены)-ROW('Данные для расчета'!S10))-ROW('Данные для расчета'!S10))","v":"  "}]
[null,"Строительство распределительных пунктов",null,null,"нет"," "]
[null,{"$error":"#NUM!"},null,null,{"$error":"#NUM!"},{"$error":"#NUM!"}]
[null,{"$error":"#NUM!"},null,null,{"$error":"#NUM!"},{"$error":"#NUM!"}]
[null,{"$error":"#NUM!"},null,null,{"$error":"#NUM!"},{"$error":"#NUM!"}]
[null,{"$error":"#NUM!"},null,null,{"$error":"#NUM!"},{"$error":"#NUM!"}]
[null,{"$error":"#NUM!"},null,null,{"$error":"#NUM!"},{"$error":"#NUM!"}]
[null,{"$error":"#NUM!"},null,null,{"$error":"#NUM!"},{"$error":"#NUM!"}]
[null,{"$error":"#NUM!"},null,null,{"$error":"#NUM!"},{"$error":"#NUM!"}]
[null,{"$error":"#NUM!"},null,null,{"$error":"#NUM!"},{"$error":"#NUM!"},null,null,null,null,null,null,null,null,null,null,null,null,null,null,null,null,null,null,null,null,null,{"$f":"ROUND(,2)","v":0}]
[null,{"$error":"#NUM!"},null,null,{"$error":"#NUM!"},{"$error":"#NUM!"}]
[null,{"$error":"#NUM!"},null,null,{"$error":"#NUM!"},{"$error":"#NUM!"}]
[null,{"$error":"#NUM!"},null,null,{"$error":"#NUM!"},{"$error":"#NUM!"}]
[null,{"$error":"#NUM!"},null,null,{"$error":"#NUM!"},{"$error":"#NUM!"}]
[null,{"$error":"#NUM!"},null,null,{"$error":"#NUM!"},{"$error":"#NUM!"}]
[null,{"$error":"#NUM!"},null,null,{"$error":"#NUM!"},{"$error":"#NUM!"}]
[null,{"$error":"#NUM!"},null,null,{"$error":"#NUM!"},{"$error":"#NUM!"}]
[null,{"$error":"#NUM!"},null,null,{"$error":"#NUM!"},{"$error":"#NUM!"}]
[null,{"$error":"#NUM!"},null,null,{"$error":"#NUM!"},{"$error":"#NUM!"}]
[null,{"$error":"#NUM!"},null,null,{"$error":"#NUM!"},{"$error":"#NUM!"}]
[null,{"$error":"#NUM!"},null,null,{"$error":"#NUM!"},{"$error":"#NUM!"}]
[null,{"$error":"#NUM!"},null,null,{"$error":"#NUM!"},{"$error":"#NUM!"}]
[null,{"$error":"#NUM!"},null,null,{"$error":"#NUM!"},{"$error":"#NUM!"}]
[null,{"$error":"#NUM!"},null,null,{"$error":"#NUM!"},{"$error":"#NUM!"}]
[null,{"$error":"#NUM!"},null,null,{"$error":"#NUM!"},{"$error":"#NUM!"}]
[null,{"$error":"#NUM!"},null,null,{"$error":"#NUM!"},{"$error":"#NUM!"}]
[null,{"$error":"#NUM!"},null,null,{"$error":"#NUM!"},{"$error":"#NUM!"}]
[null,null,null,null,null,{"$error":"#NUM!"}]
[null,"Плата за технологическое присоединение расчитывается по формуле:",null,null,null,null,null,null,null,null,null,{"$f":"ROUND(E51,2)","v":0}]
[null,"P=(C1.1+С1.2+С1.3+С1.4)*N+C2*Lвл*Z+C3*Lкл*Z+C4*N*Z), и составляет:      "]
[]
[]
[null,"без НДС и                                                                                                                                                       индекса дефлятора : ",null,null,{"$f":"ROUND((E9*E66)+(VALUE('Данные для расчета'!U2)*VALUE(Калькулятор!E83))+(VALUE('Данные для расчета'!U4)*VALUE(Калькулятор!F83))+(VALUE('Данные для расчета'!U12)*VALUE(Калькулятор!H83))+(VALUE('Данные для расчета'!U14)*VALUE(Калькулятор!H83))+(VALUE('Данные для расчета'!U6)*VALUE(G83))+(VALUE('Данные для расчета'!U8)*VALUE(F83))+(VALUE('Данные для расчета'!U10)*VALUE(G83)),2)","v":0},"с учетом индекса-дефлятора*:",{"$f":"IF(E12=\"1\",L47,IF(E12=\"2\",L51,IF(E12=\"3\",L53,IF(E12=\"4\",L57,0))))","v":0},null,{"$f":"E51+G51","v":0},null,null,{"$f":"ROUND((E51/2)*(E86/100)+((E51/2)*((E86/100)*(F86/100))),2)","v":0}]
[]
[null,"НДС (18%) :",null,null,{"$f":"G51*18%","v":0},"ИТОГО с НДС:     (руб.)",{"$f":"G51+E53","v":0},null,null,null,null,{"$f":"ROUND((E51/2)*((E86/100)*(((F86-100)/2)+100)/100)+((E51/2)*(((E86/100)*(F86/100)*(G86/100)))),2)","v":0}]
[null,"без НДС      ",{"$f":"ROUND(E9*E81+D98*(D93*#REF!+D97*#REF!)+E98*(E93*#REF!+E97*#REF!)+F98*(F93*#REF!+F97*#REF!)+G98*(G93*#REF!+G97*#REF!)+H98*(H97+H93)*E9*O7+I98*(I97+I93)*E9+J98*(J97+J93)*E9,2)","v":{"$error":"#REF!"}},"НДС (18%)  ",{"$f":"C54*18%","v":{"$error":"#REF!"}},"Итого с НДС ",{"$f":"C54+E54","v":{"$error":"#REF!"}},"руб."]
[]
[]
[null,"Справочные данные в соответствии с Постановлением ГК РБ по тарифам №711 от 19.12.2016г.:",null,null,null,null,"руб/кВт (без учета НДС)",null,null,null,null,{"$f":"ROUND((E51/2)*((E86/100)*(F86/100))+((E51/2)*((E86/100)*(F86/100)*(G86/100)*(H86/100))),2)","v":0}]
[null,"Стандартизированная тарифная ставка на покрытие расходов на технологическое присоединение энергопринимающих устройств потребителей электрической энергии, объектов электросетевого хозяйства, принадлежащих сетевым организациям и иным лицам в ценах периода регулирования",null,null,"Постоянная схема электроснабжения",null,null,"Временная схема электро- снабжения"]
[null,null,null,null,"0,4-10 кВ"]
[null,null,null,null,"до 150 кВт включительно","от 150 кВт до 670 кВт  включительно","свыше 670 кВт  включительно","до 8900 кВт"]
{"$rows_left_out":55}
{"sheet":"Данные для расчета","index":1,"n_rows":300,"n_cols":26,"rows_kept":300,"cut":false,"hidden":false,"merged":[[4,11,6,11],[290,1,290,7],[12,1,12,7],[40,1,40,7],[232,1,232,7],[244,1,244,7],[4,1,6,1],[4,6,6,6],[4,7,6,7],[4,8,6,8],[5,10,6,10],[5,9,6,9],[4,9,4,10],[4,2,4,5],[5,2,5,4],[5,5,6,5],[296,1,296,7],[0,0,2,10],[280,1,280,7],[271,1,271,7],[264,1,264,7],[257,1,257,7],[11,1,11,7],[18,1,18,7],[32,1,32,7],[41,1,41,7],[46,1,46,7],[60,1,60,7],[67,1,67,7],[114,1,114,7],[4,0,6,0],[8,1,9,10]]}
["Стандартизированные тарифные ставки за технологическое присоединение заявителей к электрическим сетям                                                                                                          ООО \"ГИП-Электро\" на 2017 год"]
[null,null,null,null,null,null,null,null,null,null,null,null,null,null,null,null,null,null,null,"Сумма ВЛ",{"$f":"SUM(N14:N65)","v":0},null,{"$f":"VALUE(U2)*3.77","v":0},null,null,{"$f":"SUM(N10:N61)","v":0}]
[]
[null,null,null,null,null,null,null,null,null,null,null,null,null,null,null,null,null,null,null,"Сумма КЛ(ал) тр",{"$f":"SUM(N70:N82,N84:N90,N101:N106,N110:N114,N117:N127,N132:N138,N140:N148,N150:N170,N171,N176:N182)","v":0},null,{"$f":"VALUE(U4)*4.45","v":0},null,null,{"$f":"SUM(N67:N130)","v":0}]
["№ п/п","Наименование стандартизированных тарифных ставок ","Выбор материалов",null,null,null,null,null,"Количество, км, кВт","Стоимость в ценах в 2001г."]
[null,null,"Максимальная присоединяемая мощность до, кВт",null,null,"Максимальная длина линии, км",null,null,null," На уровне напряжения ниже 35 кВ и мощностью до 150 кВт включительно","На уровне напряжения ниже 35 кВ и мощностью от 150 до 8900 кВт",null,null,null,null,null,null,null,null,"Сумма КЛ(мед) тр",{"$f":"SUM(N92:N99,N107:N109,N129:N130,N172:N175)","v":0},null,{"$f":"VALUE(U12)*5.63","v":0},null,null,{"$f":"SUM(N233:N296)","v":0}]
[null,null,"0,38 кВ","6 кВ","10 кВ"]
[1,2,3,4,5,6,null,null,"7","8","9",null,null,null,null,null,null,null,null,"Сумма КЛ(ал) гнб",{"$f":"SUM(N185:N189,N194:N202,N204:N212,N215:N219,N221:N230)","v":0},null,{"$f":"VALUE(U14)*5.63","v":0},null,null,{"$f":"SUM(N298:N300)","v":0}]
[]
[null,null,null,null,null,null,null,null,null,null,null,null,null,null,null,null,null,null,null,"Сумма КЛ(мед) гнб",{"$f":"SUM(N213:N214,N220,N190:N193)","v":0}]
["1.","Строительство воздушных линий",null,null,null,null," "," ",null,null,null," ",{"$f":"IF(VALUE(U2)>0,\"да\",\"нет\")","v":"нет"}]
[null,"ВЛ 0,4 кВ ",null,null,null,null,null,null,null,null,null," ",null,null,null,null,null,null,null,"Сумма ТП",{"$f":"SUM(N234:N296)","v":0},null,{"$f":"VALUE(U16)*5.63","v":0},null,null,{"$f":"SUM(#REF!)","v":{"$error":"#REF!"}}]
["1.1.","ВЛ 0,4 кВ деревянные опоры с ж/б приставками ",null,null,null,null,null,null,null,null,null," "]
["1.1.1.","ВЛИ 0,4 кВ проводом СИП сечением до 25 мм² на деревянных опорах с ж/б приставками (ввода)",76.149112000000002,null,null,0.11,null,null,null,{"$f":"K14/2","v":40432.06},80864.12,{"$f":"ROUND(IF(VALUE(Калькулятор!$E$10)>150,K14,J14),2)","v":40432.06},{"$f":"CONCATENATE(I14)","v":""},{"$f":"PRODUCT(VALUE(L14),IF(I14=\"\",0,VALUE(I14)))","v":0},null,null,null,null,null,"Сумма РП",{"$f":"SUM(N298:N300)","v":0},null,{"$f":"SUM(W2,W4,W6,W8,W12)","v":0}]
["1.1.2.","ВЛИ 0,4 кВ проводом СИП сечением до 50 мм² на деревянных опорах с ж/б приставками (ввода)",114.223668,null,null,0.14000000000000001,null,null,null,{"$f":"K15/2","v":60436.25},120872.5,{"$f":"ROUND(IF(VALUE(Калькулятор!$E$10)>150,K15,J15),2)","v":60436.25},"",{"$f":"PRODUCT(VALUE(L15),IF(I15=\"\",0,VALUE(I15)))","v":0},null,null,null,null,null,null,null,null,{"$f":"SUM(W3,W5,W7,W11,W13)","v":0}]
["1.1.3.","ВЛИ 0,4 кВ проводом СИП  сечением до 95 мм² на деревянных опорах с ж/б приставками (1 цепное исполнение-магистраль)",175.72872000000001,null,null,0.18,null,null,null,141996.94,283993.88,{"$f":"ROUND(IF(VALUE(Калькулятор!$E$10)>150,K16,J16),2)","v":141996.94},"",{"$f":"PRODUCT(VALUE(L16),IF(I16=\"\",0,VALUE(I16)))","v":0}]
["1.1.4.","ВЛИ 0,4 кВ проводом СИП сечением до 50 мм² на деревянных опорах с ж/б приставками (1 цепное исполнение)",114.223668,null,null,0.14000000000000001,null,null,null,119042.29,238084.58,{"$f":"ROUND(IF(VALUE(Калькулятор!$E$10)>150,K17,J17),2)","v":119042.29},"",{"$f":"PRODUCT(VALUE(L17),IF(I17=\"\",0,VALUE(I17)))","v":0}]
["1.1.5.","ВЛИ 0,4 кВ проводом СИП сечением до 70 мм² на деревянных опорах с ж/б приставками (1 цепное исполнение)",140.582976,null,null,0.16,null,null,null,{"$f":"K18/2","v":124079.465},248158.93,{"$f":"ROUND(IF(VALUE(Калькулятор!$E$10)>150,K18,J18),2)","v":124079.47},"",{"$f":"PRODUCT(VALUE(L18),IF(I18=\"\",0,VALUE(I18)))","v":0}]
["1.2.","ВЛ 0,4 кВ железобетонные опоры",null,null,null,null,null,null,null,null,null," ",""]
["1.2.1.","ВЛИ 0,4 кВ проводом СИП сечением до 25 мм² на ж/б опорах (ввод)",76.149112000000002,null,null,0.11,null,null,null,40432.06,80864.12,{"$f":"ROUND(IF(VALUE(Калькулятор!$E$10)>150,K20,J20),2)","v":40432.06},"",{"$f":"PRODUCT(VALUE(L20),IF(I20=\"\",0,VALUE(I20)))","v":0}]
["1.2.2.","ВЛИ 0,4 кВ проводом СИП сечением до 35 мм² на ж/б опорах (ввод)",null,null,null,null,null,null,null,45009.625,90019.25,{"$f":"ROUND(IF(VALUE(Калькулятор!$E$10)>150,K21,J21),2)","v":45009.63},"",{"$f":"PRODUCT(VALUE(L21),IF(I21=\"\",0,VALUE(I21)))","v":0}]
["1.2.3.","ВЛИ 0,4 кВ проводом СИП сечением до 50 мм² на ж/б опорах (ввод)",114.223668,null,null,0.14000000000000001,null,null,null,50452.26,100904.52,{"$f":"ROUND(IF(VALUE(Калькулятор!$E$10)>150,K22,J22),2)","v":50452.26},"",0]
["1.2.4.","ВЛИ 0,4 кВ проводом СИП сечением до 70 мм² на ж/б опорах (ввод)",null,null,null,null,null,null,null,60436.25,120872.5,{"$f":"ROUND(IF(VALUE(Калькулятор!$E$10)>150,K23,J23),2)","v":60436.25},"",0]
["1.2.5.","ВЛИ 0,4 кВ проводом СИП сечением до 16 мм² на ж/б опорах (1 цепное исполнение)",null,null,null,null,null,null,null,62222.21,124444.42,{"$f":"ROUND(IF(VALUE(Калькулятор!$E$10)>150,K24,J24),2)","v":62222.21},"",0]
["1.2.6.","ВЛИ 0,4 кВ проводом СИП сечением до 25 мм² на ж/б опорах (1 цепное исполнение)",null,null,null,null,null,null,null,75511.774999999994,151023.54999999999,{"$f":"ROUND(IF(VALUE(Калькулятор!$E$10)>150,K25,J25),2)","v":75511.78},"",0]
["1.2.7.","ВЛИ 0,4 кВ проводом СИП сечением до 35 мм² на ж/б опорах (1 цепное исполнение)",null,null,null,null,null,null,null,90337.384999999995,180674.77,{"$f":"ROUND(IF(VALUE(Калькулятор!$E$10)>150,K26,J26),2)","v":90337.39},"",0]
["1.2.8.","ВЛИ 0,4 кВ проводом СИП сечением до 50 мм² на ж/б опорах (1 цепное исполнение)",114.223668,null,null,0.14000000000000001,null,null,null,105171.99,210343.98,{"$f":"ROUND(IF(VALUE(Калькулятор!$E$10)>150,K27,J27),2)","v":105171.99},"",{"$f":"PRODUCT(VALUE(L27),IF(I27=\"\",0,VALUE(I27)))","v":0}]
["1.2.9.","ВЛИ 0,4 кВ проводом СИП сечением до 70 мм² на ж/б опорах (1 цепное исполнение)",140.582976,null,null,0.16,null,null,null,120158.24,240316.48,{"$f":"ROUND(IF(VALUE(Калькулятор!$E$10)>150,K28,J28),2)","v":120158.24},"",{"$f":"PRODUCT(VALUE(L28),IF(I28=\"\",0,VALUE(I28)))","v":0}]
["1.2.10.","ВЛИ 0,4 кВ проводом СИП сечением до 95 мм² на ж/б опорах (1 цепное исполнение)",null,null,null,null,null,null,null,126518.99,253037.98,{"$f":"ROUND(IF(VALUE(Калькулятор!$E$10)>150,K29,J29),2)","v":126518.99},"",{"$f":"PRODUCT(VALUE(L29),IF(I29=\"\",0,VALUE(I29)))","v":0}]
["1.2.11.","ВЛИ 0,4 кВ проводом СИП сечением  120 мм² на ж/б опорах (1 цепное исполнение)",null,null,null,null,null,null,null,148663.595,297327.19,{"$f":"ROUND(IF(VALUE(Калькулятор!$E$10)>150,K30,J30),2)","v":148663.6},"",0]
["1.2.12.","ВЛИ 0,4 кВ проводом СИП сечением 150 мм² на ж/б опорах (1 цепное исполнение)",null,null,null,null,null,null,null,152270.82,304541.64,{"$f":"ROUND(IF(VALUE(Калькулятор!$E$10)>150,K31,J31),2)","v":152270.82},"",0]
["1.2.13.","ВЛИ 0,4 кВ проводом СИП сечением 185 мм² на ж/б опорах (1 цепное исполнение)",null,null,null,null,null,null,null,155878.04,311756.08,{"$f":"ROUND(IF(VALUE(Калькулятор!$E$10)>150,K32,J32),2)","v":155878.04},"",0]
["1.3.","ВЛ 0,4 кВ по существующим опорам",null,null,null,null,null,null,null,null," "," ",""]
["1.3.1.","ВЛИ 0,4 кВ проводом АС с площадью поперечного сечения (50) по существующим опорам",null,null,null,null,null,null,null,47297.98,94595.96,{"$f":"ROUND(IF(VALUE(Калькулятор!$E$10)>150,K34,J34),2)","v":47297.98},"",0]
["1.3.2.","ВЛИ 0,4 кВ проводом СИП сечением до 16 мм² по существующим опорам",null,null,null,null,null,null,null,39244.480000000003,78488.960000000006,{"$f":"ROUND(IF(VALUE(Калькулятор!$E$10)>150,K35,J35),2)","v":39244.480000000003},"",0]
["1.3.3.","ВЛИ 0,4 кВ проводом СИП сечением до 25 мм² по существующим опорам",null,null,null,null,null,null,null,40813.74,81627.48,{"$f":"ROUND(IF(VALUE(Калькулятор!$E$10)>150,K36,J36),2)","v":40813.74},"",0]
["1.3.4.","ВЛИ 0,4 кВ проводом СИП сечением до 35 мм² по существующим опорам",null,null,null,null,null,null,null,42446.77,84893.54,{"$f":"ROUND(IF(VALUE(Калькулятор!$E$10)>150,K37,J37),2)","v":42446.77},"",0]
["1.3.5.","ВЛИ 0,4 кВ проводом СИП сечением до 50 мм² по существующим опорам",114.223668,null,null,0.14000000000000001,null,null,null,46419.02,92838.04,{"$f":"ROUND(IF(VALUE(Калькулятор!$E$10)>150,K38,J38),2)","v":46419.02},"",0]
["1.3.6.","ВЛИ 0,4 кВ проводом СИП сечением до 70 мм² по существующим опорам",140.582976,null,null,0.16,null,null,null,58436.605000000003,116873.21,{"$f":"ROUND(IF(VALUE(Калькулятор!$E$10)>150,K39,J39),2)","v":58436.61},"",0]
["1.3.7.","ВЛИ 0,4 кВ проводом СИП сечением до 95 мм² по существующим опорам",175.72872000000001,null,null,0.18,null,null,null,67766.544999999998,135533.09,{"$f":"ROUND(IF(VALUE(Калькулятор!$E$10)>150,K40,J40),2)","v":67766.55},"",0]
[null,"ВЛ-6-10 кВ",null,null,null,null,null,null,null,null,null," "]
["1.4.","ВЛ-6-10 кВ деревянные опоры с ж/б приставками ",null,null,null,null,null,null,null,null,null," ",{"$f":"CONCATENATE(I42)","v":""}]
["1.4.1.","ВЛЗ 6-10 кВ проводом СИП сечением до 50 мм² на деревянных опорах с ж/б приставками (1 цепное исполнение)",null,1803.5316,3005.886,2.7,null,null,null,143765.19500000001,287530.39,{"$f":"ROUND(IF(VALUE(Калькулятор!$E$10)>150,K43,J43),2)","v":143765.20000000001},"",{"$f":"PRODUCT(VALUE(L43),IF(I43=\"\",0,VALUE(I43)))","v":0}]
["1.4.2.","ВЛЗ 6-10 кВ проводом СИП сечением до 70 мм² на деревянных опорах с ж/б приставками (1 цепное исполнение)",null,2219.7312000000002,3699.5520000000001,3.3,null,null,null,167369.26999999999,334738.53999999998,{"$f":"ROUND(IF(VALUE(Калькулятор!$E$10)>150,K44,J44),2)","v":167369.26999999999},"",{"$f":"PRODUCT(VALUE(L44),IF(I44=\"\",0,VALUE(I44)))","v":0}]
["1.4.3.","ВЛЗ 6-10 кВ проводом СИП сечением до 95 мм² на деревянных опорах с ж/б приставками (1 цепное исполнение)",null,2774.6640000000002,4624.4399999999996,2.5,null,null,null,194317.94,388635.88,{"$f":"ROUND(IF(VALUE(Калькулятор!$E$10)>150,K45,J45),2)","v":194317.94},"",{"$f":"PRODUCT(VALUE(L45),IF(I45=\"\",0,VALUE(I45)))","v":0}]
["1.4.4.","ВЛЗ 6-10 кВ проводом СИП сечением до 120  мм² на деревянных опорах с ж/б приставками (1 цепное исполнение)",null,3144.6192000000001,5241.0320000000002,2.5,null,null,null,222463.185,444926.37,{"$f":"ROUND(IF(VALUE(Калькулятор!$E$10)>150,K46,J46),2)","v":222463.19},"",{"$f":"PRODUCT(VALUE(L46),IF(I46=\"\",0,VALUE(I46)))","v":0}]
["1.5.","ВЛ 6-10 кВ (железобетонные опоры)",null,null,null,null,null,null,null,null,null," ",""]
["1.5.1.","ВЛЗ 6-10 кВ с проводом СИП сечением до 35 мм² на ж/б опорах (1 цепное исполнение)",null,null,null,null,null,null,null,128180.315,256360.63,{"$f":"ROUND(IF(VALUE(Калькулятор!$E$10)>150,K48,J48),2)","v":128180.32},"",{"$f":"PRODUCT(VALUE(L48),IF(I48=\"\",0,VALUE(I48)))","v":0}]
["1.5.2.","ВЛЗ 6-10 кВ с проводом СИП сечением до 50 мм² на ж/б опорах (1 цепное исполнение)",null,1803.5316,3005.886,2.7,null,null,null,141665.375,283330.75,{"$f":"ROUND(IF(VALUE(Калькулятор!$E$10)>150,K49,J49),2)","v":141665.38},"",{"$f":"PRODUCT(VALUE(L49),IF(I49=\"\",0,VALUE(I49)))","v":0}]
["1.5.3.","ВЛЗ 6-10 кВ с проводом СИП сечением до 70 мм² на ж/б опорах (1 цепное исполнение)",null,2219.7312000000002,3699.5520000000001,3.3,null,null,null,153157.185,306314.37,{"$f":"ROUND(IF(VALUE(Калькулятор!$E$10)>150,K50,J50),2)","v":153157.19},"",0]
["1.5.4.","ВЛЗ 6-10 кВ с проводом СИП сечением до 70 мм² на ж/б опорах (2 цепное исполнение)",null,null,null,null,null,null,null,321630.09000000003,643260.18000000005,{"$f":"ROUND(IF(VALUE(Калькулятор!$E$10)>150,K51,J51),2)","v":321630.09000000003},"",0]
["1.5.5.","ВЛЗ 6-10 кВ с проводом СИП сечением до 95 мм² на ж/б опорах (1 цепное исполнение)",null,2774.6640000000002,4624.4399999999996,2.5,null,null,null,163123.6,326247.2,{"$f":"ROUND(IF(VALUE(Калькулятор!$E$10)>150,K52,J52),2)","v":163123.6},"",0]
["1.5.6.","ВЛЗ 6-10 кВ с проводом СИП сечением до 95 мм² на ж/б опорах (2 цепное исполнение)",null,null,null,null,null,null,null,342559.56,685119.12,{"$f":"ROUND(IF(VALUE(Калькулятор!$E$10)>150,K53,J53),2)","v":342559.56},"",0]
["1.5.7.","ВЛЗ 6-10 кВ с проводом СИП сечением до 120 мм² на ж/б опорах (1 цепное исполнение)",null,3144.6192000000001,5241.0320000000002,2.5,null,null,null,176280.095,352560.19,{"$f":"ROUND(IF(VALUE(Калькулятор!$E$10)>150,K54,J54),2)","v":176280.1},"",0]
["1.5.8.","ВЛЗ 6-10 кВ с проводом СИП сечением до 150 мм² на ж/б опорах (1 цепное исполнение)",null,null,null,null,null,null,null,182392.89,364785.78,{"$f":"ROUND(IF(VALUE(Калькулятор!$E$10)>150,K55,J55),2)","v":182392.89},"",0]
["1.5.9.","ВЛЗ 6-10 кВ с проводом СИП сечением до 120 мм² на ж/б опорах (2 цепное исполнение)",null,null,null,null,null,null,null,370188.20500000002,740376.41,{"$f":"ROUND(IF(VALUE(Калькулятор!$E$10)>150,K56,J56),2)","v":370188.21},"",0]
["1.5.10.","ВЛЗ 6-10 кВ с проводом АС сечением до 35 мм² на ж/б опорах (1 цепное исполнение)",null,null,null,null,null,null,null,100214.485,200428.97,{"$f":"ROUND(IF(VALUE(Калькулятор!$E$10)>150,K57,J57),2)","v":100214.49},"",0]
["1.5.11.","ВЛЗ 6-10 кВ с проводом АС сечением до 50 мм² на ж/б опорах (1 цепное исполнение)",null,null,null,null,null,null,null,111984.82,223969.64,{"$f":"ROUND(IF(VALUE(Калькулятор!$E$10)>150,K58,J58),2)","v":111984.82},"",0]
["1.5.12.","ВЛЗ 6-10 кВ с проводом АС сечением до 70 мм² на ж/б опорах (1 цепное исполнение)",null,null,null,null,null,null,null,117799.845,235599.69,{"$f":"ROUND(IF(VALUE(Калькулятор!$E$10)>150,K59,J59),2)","v":117799.85},"",0]
["1.5.13.","ВЛЗ 6-10 кВ с проводом АС сечением до 95 мм² на ж/б опорах (1 цепное исполнение)",null,null,null,null,null,null,null,139806.20000000001,279612.40000000002,{"$f":"ROUND(IF(VALUE(Калькулятор!$E$10)>150,K60,J60),2)","v":139806.20000000001},"",0]
{"$rows_left_out":240}